NigeriaSat-X
type: Concept
definition: The Disaster Monitoring Constellation (DMC) is an international programme initially proposed in 1996 and led by SSTL (Surrey Satellite Technology Ltd) from the United Kingdom, to construct a network of five affordable Low Earth Orbit (LEO) microsatellites. The objective is to provide a daily global imaging capability at medium resolution (30-40 m), in 3-4 spectral bands, for rapid-response disaster monitoring and mitigation.
in scheme: platforms
change note: 2019-05-02 12:01:23.0 [mmorahan] insert Definition (id: null text: The Disaster Monitoring Constellation (DMC) is an international programme initially proposed in 1996 and led by SSTL (Surrey Satellite Technology Ltd) from the United Kingdom, to construct a network of five affordable Low Earth Orbit (LEO) microsatellites. The objective is to provide a daily global imaging capability at medium resolution (30-40 m), in 3-4 spectral bands, for rapid-response disaster monitoring and mitigation. language code: en);
change note: 2020-10-06 09:58:52.0 [mmorahan] insert AltLabel (id: null category: primary text: NigeriaSat-X language code: en);
change note: 2019-05-02 11:57:44.0 [mmorahan] Insert Concept add broader relation (NigeriaSat-X [35cafb99-393d-4727-a89d-5472512b2fdf,368745] - DMC-2G (Disaster Monitoring Constellation- 2nd Generation) [e5184d15-eec8-4703-8318-243748ddbd0e,368737]);

Disaster Monitoring Constellation- 2nd Generation (DMC-2G)
type: Concept