CC-VEx
type: Concept
change note: 2021-09-21 08:32:51.0 [tstevens] insert AltLabel (id: null category: primary text: CALIPSO-CloudSat Validation Experiment language code: en); insert Definition (id: null text: The CALIPSO-CloudSat Validation Experiment (CC-VEx) was conducted between July 24 and August 14, 2006 and was designed to provide coincident observations of cloud and aerosol (small particles) layers needed to support calibration and validation studies for two new satellite missions: CALIPSO and CloudSat. These missions provide valuable new information on vertical structure and properties of aerosols and clouds needed to improve our understanding of climate, weather, and air quality. They were launched together on a Delta II launch vehicle on April 28, 2006 and placed in formation with three other earth observing satellites into what is commonly known as the “ A-Train” satellite constellation. CALIPSO is a joint mission between NASA and the French space agency, CNES, and its payload consists of an innovative two-wavelength polarization-sensitive lidar, an infrared imaging radiometer, and a wide field-of-view camera. CloudSat is a partnership between NASA, the Canadian space agency, and the United States Air Force, and its payload consists ofa state-of-the-art cloud profiling radar operating at 94 GHz. language code: en);
change note: 2021-09-21 08:31:46.0 [tstevens] Insert Concept add broader relation (CC-VEx [36635fd7-4504-470a-8d12-b420374349dc,749514] - A - C [0c89f3f4-7ab1-43ce-89ee-795d35f0e30a,742679]);
in scheme: projects
definition: The CALIPSO-CloudSat Validation Experiment (CC-VEx) was conducted between July 24 and August 14, 2006 and was designed to provide coincident observations of cloud and aerosol (small particles) layers needed to support calibration and validation studies for two new satellite missions: CALIPSO and CloudSat. These missions provide valuable new information on vertical structure and properties of aerosols and clouds needed to improve our understanding of climate, weather, and air quality. They were launched together on a Delta II launch vehicle on April 28, 2006 and placed in formation with three other earth observing satellites into what is commonly known as the “ A-Train” satellite constellation. CALIPSO is a joint mission between NASA and the French space agency, CNES, and its payload consists of an innovative two-wavelength polarization-sensitive lidar, an infrared imaging radiometer, and a wide field-of-view camera. CloudSat is a partnership between NASA, the Canadian space agency, and the United States Air Force, and its payload consists ofa state-of-the-art cloud profiling radar operating at 94 GHz.

A - C
type: Concept