LAND SURFACE/AGRICULTURE INDICATORS
type: Concept

LANDSLIDES
type: Concept
change note: 2012-07-18 17:36:12.0 [mpmorahan] insert Definition (id: null text: A general term for a wide variety of processes and landforms involving the downslope movement, under gravity, of masses of soil and rock material. language code: en);
change note: 2012-06-26 12:04:27.0 [gee-cee] Insert Concept add broader relation (LANDSLIDES [36bdce45-37df-4475-9eed-73469a594edb,39847] - LAND SURFACE/AGRICULTURE INDICATORS [112e71ec-c0a1-49a8-82d7-bcb317b45860,39835]);
in scheme: sciencekeywords
definition: A general term for a wide variety of processes and landforms involving the downslope movement, under gravity, of masses of soil and rock material.