PIEZOMETERS
type: Concept
in scheme: instruments
definition: PIEZOMETERS are devices (tube or pipe) that allows one to determine the elevation of hydraulic head in an aquifer at a given point.

Pressure/Height Meters
type: Concept