A2 Photonic_WISe
type: Concept
change note: 2020-09-11 11:23:17.0 [sritz] insert Definition (id: null text: A2 Photonic WISe - Snow liquid water content sensor language code: en);
change note: 2020-09-11 11:21:24.0 [sritz] Insert Concept add broader relation (A2 Photonic_WISe [37513c7c-ae36-4391-90db-6a8fa08ee478,560698] - Photon/Optical Detectors [8143e95e-a438-4a2a-82b2-6d7ae079fba7,544745]);
change note: 2020-09-11 11:24:51.0 [sritz] insert AltLabel (id: null category: primary text: 2 Photonic WISe - Snow liquid water content sensor language code: en); update Definition (This handheld instrument is meant to be used in the field and measures the liquid water content of snowpacks; it's uses include detecting snowmelt onset and avalanche forecasting.); update Definition (NSIDC DAAC, https://nsidc.org/daac http://www.a2photonicsensors.com/medias/A2PS_WISe_EN.pdf http://www.a2photonicsensors.com/medias/A2PS_WISe_EN.pdf);
change note: 2020-09-11 11:24:00.0 [sritz] update Definition (NSIDC DAAC, https://nsidc.org/daac http://www.a2photonicsensors.com/medias/A2PS_WISe_EN.pdf http://www.a2photonicsensors.com/medias/A2PS_WISe_EN.pdf);
in scheme: instruments
definition: This handheld instrument is meant to be used in the field and measures the liquid water content of snowpacks; it's uses include detecting snowmelt onset and avalanche forecasting.

Photon/Optical Detectors
type: Concept