SEA SURFACE HEIGHT ANOMALY (SSHA)
type: Concept
change note: 2021-11-16 09:21:35.0 [tstevens] update PrefLabel (SEA SURFACE HEIGHT ANOMALY (SSHA));
change note: 2021-01-11 12:14:19.0 [tstevens] Insert Concept add broader relation (SEA SURFACE HEIGHT ANOMALY _SSHA_ [3798a6c9-9b39-4e22-bee4-be80d39049fe,560812] - SEA SURFACE HEIGHT [5c0b448c-7eb4-4e8c-8403-260cbb6114bb,85103]);
in scheme: sciencekeywords
definition: Difference of sea surface height and mean sea surface. Sea surface height may be corrected using models for effects such as tides and atmospheric forcing

SEA SURFACE HEIGHT
type: Concept