TRANSPORTATION
type: Concept
change note: 2017-03-10 08:25:21.0 [tstevens] update Definition (The roads and equipment necessary for the movement of goods or passengers.); update Definition (http://www.Dictionary.com);
in scheme: sciencekeywords
definition: The roads and equipment necessary for the movement of goods or passengers.

INFRASTRUCTURE
type: Concept