LABELS
type: Concept

RASTER LABEL
type: Concept
change note: 2022-07-27 08:33:52.0 [tstevens] update Definition (Encyclopedia of Machine Learning and Data Science: https://doi.org/10.1007/978-1-4899-7502-7);
change note: 2022-07-26 08:26:04.0 [tstevens] insert Definition (id: null text: Raster labels are a type of label that masks pixels in raster data in order to identify a data feature or attribute in a machine learning workflow. language code: en);
change note: 2022-07-25 15:50:37.0 [tstevens] Insert Concept add broader relation (RASTER LABEL [381a3ad7-64e9-464e-b5aa-c9ce0520546c,996703] - LABELS [4afb9415-fed3-4fd5-87d2-43fed132f567,996702]);
in scheme: sciencekeywords
definition: Raster labels are a type of label that masks pixels in raster data in order to identify a data feature or attribute in a machine learning workflow.