UPPER LEVEL WINDS
type: Concept

FLIGHT LEVEL WINDS
type: Concept
change note: 2017-04-21 11:29:52.0 [tstevens] update Definition (Winds experienced by an aircraft during flight level at any altitude. ); update Definition (NASA/MSFC/GHRC Staff);
change note: 2017-04-20 14:43:09.0 [sritz] Move Concepts delete broader relation (null); add broader relation (FLIGHT LEVEL WINDS [385af5fe-ad73-4e04-9d51-675599fb0576,83371] - UPPER LEVEL WINDS [592d49c4-e8ae-4ab4-bf24-ae4a896d0637,83357]);
in scheme: sciencekeywords
definition: Winds experienced by an aircraft during flight level at any altitude.