DEVEL-TECH
type: Concept
in scheme: providers
definition: We have extensive expertise in these areas, having undertaken hundreds of projects conducted on behalf of a range of public and private sector agencies. Devel-Tech is an independent and experienced consultant with many years of industry experience in addition to strong academic backgrounds in the vast capabilities of GIS and mapping. We are totally independent of any hardware, conversion, or other vendors in the disciplines of GIS, MIS, and Remote Sensing. This allows us to provide our clients the optimum solution based upon their unique and specific requirements. In order to leverage our Geomatics expertise into specific application areas or to integrate emerging technologies, Devel-Tech actively pursues cooperative partnerships with private industry organizations. A number of such joint initiatives are currently underway and Devel-Tech is open to discussing all such mutually beneficial undertakings. Summary provided by http://www.develtech.ca/compframe.htm

COMMERCIAL
type: Concept