NASA MACH-2
type: Concept
change note: 2023-06-15 14:35:31.0 [tstevens] Insert Concept add narrower relation (NASA MACH-2 [389bc2cd-ddff-4d2d-806f-fbead30f3974,1350573] - NASA Mobile Aerosol Characterization laboratory [e7cea2b9-02df-4ea3-845a-0ff123605983,1350574]);
change note: 2023-06-15 14:41:01.0 [tstevens] Remove Concepts delete narrower relation (null);
change note: 2023-06-15 14:40:28.0 [tstevens] insert AltLabel (id: null category: primary text: NASA Mobile Aerosol Characterization laboratory language code: en); insert Definition (id: null text: The NASA Langley Aerosol Research Group (LARGE; https://science-data.larc.nasa.gov/large/) deployed the NASA Mobile Aerosol Characterization laboratory (MACH-2) with Boise, ID as a home base. The MACH-2 was driven to the fires as listed in Table 1 to investigate smoke for up to 5 days like in the case of the Williams Flats fire. The MACH-2 coordinated with other research platforms, including the NOAA Twin Otters, the Aerodyne Mobile Laboratory (AML), the Mobile Dragons, and the NASA DC-8. The MACH-2 traveled 13,300 miles in 51 days, sampled eight fires in six different states, and recorded 10.5 days of 1-s data. language code: en);
change note: 2023-06-15 14:34:58.0 [tstevens] Insert Concept add broader relation (NASA MACH-2 [389bc2cd-ddff-4d2d-806f-fbead30f3974,1350573] - Vehicles [8dc44d7b-e349-42ab-860e-18f5acfc1b28,1340835]);
definition: The NASA Langley Aerosol Research Group (LARGE; https://science-data.larc.nasa.gov/large/) deployed the NASA Mobile Aerosol Characterization laboratory (MACH-2) with Boise, ID as a home base. The MACH-2 was driven to the fires as listed in Table 1 to investigate smoke for up to 5 days like in the case of the Williams Flats fire. The MACH-2 coordinated with other research platforms, including the NOAA Twin Otters, the Aerodyne Mobile Laboratory (AML), the Mobile Dragons, and the NASA DC-8. The MACH-2 traveled 13,300 miles in 51 days, sampled eight fires in six different states, and recorded 10.5 days of 1-s data.
in scheme: platforms

Vehicles
type: Concept