NIL-U/GEOL
type: Concept
in scheme: providers
definition: Faculty and students in the Department of Geology and Environmental Geosciences at Northern Illinois University are involved in a broad range of theoretical and applied research, teaching, and teacher training, at the cutting edge of the Earth Sciences. Summary Provided By: http://jove.geol.niu.edu/

ACADEMIC
type: Concept