UC-LONDON/CPOM
type: Concept
change note: 2019-05-06 11:07:13.0 [mmorahan] insert Definition (id: null text: The Centre for Polar Observation and Modelling (CPOM) is a NERC Centre of Excellence that studies processes in the Earth’s polar latitudes that can affect the Earth’s albedo, polar atmosphere and ocean circulation, and global sea level. CPOM uses theoretical and laboratory-derived information to form new models of interactions between the ice, ocean and atmosphere, and uses ground and satellite observations to test these and other climate models. The CPOM Directorate is based at the University of Leeds, and we have researchers at the Universities of Bristol and Reading and at University College London. CPOM is funded by the Natural Environment Research Council (NERC). We also work closely with the British Antarctic Survey (BAS), National Oceanography Centre (NOC), National Centre for Earth Observation (NCEO) and European Space Agency (ESA). language code: en); insert Resource (id: null type: provider url: http://www.cpom.ucl.ac.uk/cpom_ucl_only/data_resources.html);
change note: 2019-05-06 10:59:00.0 [mmorahan] Insert Concept add broader relation (UC-LONDON/CPOM [39d392e2-dedc-47c1-b858-1991394ebc26,368797] - ACADEMIC [7700280b-68ee-4644-bf5e-84e7a6adf897,337181]);
in scheme: providers
definition: The Centre for Polar Observation and Modelling (CPOM) is a NERC Centre of Excellence that studies processes in the Earth’s polar latitudes that can affect the Earth’s albedo, polar atmosphere and ocean circulation, and global sea level. CPOM uses theoretical and laboratory-derived information to form new models of interactions between the ice, ocean and atmosphere, and uses ground and satellite observations to test these and other climate models. The CPOM Directorate is based at the University of Leeds, and we have researchers at the Universities of Bristol and Reading and at University College London. CPOM is funded by the Natural Environment Research Council (NERC). We also work closely with the British Antarctic Survey (BAS), National Oceanography Centre (NOC), National Centre for Earth Observation (NCEO) and European Space Agency (ESA).

ACADEMIC
type: Concept