DATA MANAGEMENT/DATA HANDLING
type: Concept

DATA SEARCH
type: Concept
change note: 2020-05-21 11:30:03.0 [tstevens] Insert Concept add broader relation (DATA SEARCH [39f3bca5-0abf-4af7-9385-865b99c06b8f,560205] - DATA MANAGEMENT/DATA HANDLING [02d92216-70c6-437c-8c15-2b76f2132921,84025]);
in scheme: sciencekeywords
definition: Refers to searching for data in data retrieval systems.