LP
type: Concept
in scheme: projects
definition: In English: This project is aimed to achieve a higher knowledge of the limnetic systems in Polar latitudes. Particularly, it promotes the accurate description the Byers Peninsula (Livingston Island), considered one of the most important freshwater zones in the Maritime Antarctica, as well as Deception Island. This project is related to an international Polar Latitudinal Gradient aimed at understanding the effects of the environmental variables related with latitude (temperature and radiation) on the biodiversity of the freshwater ecosystems, and also modelling the effects of the Global Climate Change on these kind of ecosystems. This proposal involves scientists from different institutions with extensive expertise on the organisms that will be found in these ecosystems. Moreover, this proposal is closely linked with other groups from overseas, this fact will allow an exchange, both of scientists and data collected from the different ecosystems, representing an evident benefit in the production and validation of models. En Español: El presente proyecto pretende aumentar el conocimiento de los ecosistemas limnéticos en las zonas polares. En particular se espera describir con precisión la Península Byers (Isla Livingston) una de las zonas de ecosistemas dulceacuícolas más importantes de la Antártida Marítima, así como Isla Decepción. Este proyecto a su vez participa de un gradiente latitudinal polar en cooperación con otros programas polares internacionales con doble objetivo: por un lado estudiar las variaciones en biodiversidad en estos ecosistemas acuáticos, lo que permitirá entender como las variaciones ambientales asociadas a la latitud (radiación y temperatura) afectan a la diversidad biológica; y por otro lado pretende pronosticar las variaciones ecológicas que experimentarán los ecosistemas polares en un evento de cambio climático global. El estudio aquí propuesto incorpora especialistas, procedentes de distintos centros de investigación, en los distintos aspec…

J - L
type: Concept