Propeller
type: Concept

PA-12
type: Concept
change note: 2021-11-17 13:21:59.0 [tstevens] Move Concepts delete broader relation (null); add broader relation (PA-12 [3a710b96-89c3-4783-b811-e9c5a3f3784f,826140] - Propeller [6175c78e-432c-4254-b442-40d3cf0f6b34,835882]);
in scheme: platforms
definition: From August 9 to December 10, 1947, Clifford Evans and George Truman circled the globe in their Piper Super Cruisers, covering 35,897 kilometers (22,436 miles), the first time light personal aircraft accomplished such a feat. Evans flew the City of Washington while Truman flew the City of The Angels, now at the Piper Aviation Museum in Lock Haven, Pennsylvania. The PA-12 was a more powerful J-5 Cruiser, with an electric starter, navigation lights, and a cabin heater. For the flight, Piper Aircraft arranged for second-hand planes and extra fuel tanks while radio and navigation equipment were also donated. Evans built a drift meter for each aircraft. Flags of each nation they visited were hand-painted on the fuselages' left sides and 53 of 55 city stops on the right sides. Group: Platform_Details Entry_ID: PA-12 Group: Platform_Identification Platform_Category: Aircraft Short_Name: PA-12 Long_Name: Piper PA-12 Super Cruiser End_Group Creation_Date: 2012-07-23 Online_Resource: http://airandspace.si.edu/collections/artifact.cfm?id=A19500101000 Sample_Image: http://airandspace.si.edu/images/collections/media/previews/A19500101000cp02.jpg End_Group