UMAINE
type: Concept
in scheme: providers
definition: The University of Maine advances learning and discovery through excellence and innovation in undergraduate and graduate academic programs while addressing the complex challenges and opportunities of the 21st century through research-based knowledge. Inspiring and dedicated teaching propels students into new fields of learning and promotes interdisciplinary understanding. Our educational goals is to help students develop their creative abilities, communication, and critical thinking skills, and understanding of traditions in ethics and rationality within the arts, sciences, and professions. Internationally recognized research, scholarship, and creative activity distinguish the University of Maine as the state’s flagship university, where faculty and students contribute knowledge to issues of local, national, and international significance. As the state’s doctoral-granting institution, research and education are inextricably linked. Comprehensive outreach, including public service, Cooperative Extension, continuing education, and distance learning, engages learners of all ages in improving their lives and communities. Using research-based knowledge, outreach efforts promote sustainable use of Maine’s abundant natural resources and build intellectual, cultural, and economic capacity throughout Maine and beyond. Through integrated teaching, research, and outreach, the University of Maine improves the quality of life for people in Maine and around the world, and promotes responsible stewardship of human, natural, and financial resources.

ACADEMIC
type: Concept