DISPERSION RATE
type: Concept
change note: 2016-03-31 10:04:22.0 [gee-cee] insert Definition (id: null text: The rate at which clay particles separate from one other in moist soil. language code: en);
change note: 2016-03-31 10:03:30.0 [gee-cee] Insert Concept add broader relation (DISPERSION RATE [3a95742c-1355-40af-ac86-e24365a67b04,158783] - DISPERSION [d2d4ee50-99ed-4ee7-b957-22271a60c031,85031]);
in scheme: sciencekeywords
definition: The rate at which clay particles separate from one other in moist soil.

DISPERSION
type: Concept