FY-1A
type: Concept
change note: 2022-05-03 12:33:26.0 [tstevens] insert AltLabel (id: null category: primary text: FengYun-1 language code: en); insert Definition (id: null text: FengYun (FengYun = wind and cloud) is a meteorological satellite series of China, organized by CMA (China Meteorological Administration). Within the meteorological program, the odd-numbered satellites (FengYun-1 or simply FY-1) refer to the polar-orbiting LEO series, while the even-numbered S/C (FY-2, FY-4, etc.) refer to the GEO series. 1) 2) The first generation LEO satellite (FY-1) series consists of a total of four spacecraft (FY-1A, -1B, -1C, and -1D). The funding body in China is the Ministry of Aerospace, while CMA (China Meteorological Administration) is the agency authorized and empowered to administer the national meteorological service in the governmental capacity, and is charged with the organizational arrangement and coordination of national meteorological affairs. language code: en);
change note: 2022-05-03 12:35:25.0 [tstevens] update AltLabel (); update PrefLabel (FY-1A);
change note: 2022-05-03 12:32:16.0 [tstevens] Insert Concept add broader relation (FY-1 [3ad82f6f-152d-4565-ada3-0f1a4ceacb6f,908988] - FengYun-1 [edf02962-aafa-484f-84e5-2549f6db7552,899851]);
change note: 2022-05-03 12:35:59.0 [tstevens] update AltLabel (FengYun-1A);
definition: FengYun (FengYun = wind and cloud) is a meteorological satellite series of China, organized by CMA (China Meteorological Administration). Within the meteorological program, the odd-numbered satellites (FengYun-1 or simply FY-1) refer to the polar-orbiting LEO series, while the even-numbered S/C (FY-2, FY-4, etc.) refer to the GEO series. 1) 2) The first generation LEO satellite (FY-1) series consists of a total of four spacecraft (FY-1A, -1B, -1C, and -1D). The funding body in China is the Ministry of Aerospace, while CMA (China Meteorological Administration) is the agency authorized and empowered to administer the national meteorological service in the governmental capacity, and is charged with the organizational arrangement and coordination of national meteorological affairs.
in scheme: platforms

FengYun-1
type: Concept