ERA MAPTEC LTD
type: Concept
in scheme: providers
definition: ERA-Maptec is a group of consultants specialising in the application of remote sensing, structural analysis, GIS and digital cartography. The company was established in 1983 and has carried projects in over 50 countries world-wide, providing high quality, confidential reports tailored to individual or multi client requirements. ERA-Maptec supplies and processes satellite data and is an agent for Eurimage, SPOT, Image and Worldmap. The company has built up an impressive portfolio of international clients with the most expert and professional service of its kind anywhere in the world today. Website: "http://www.era.ie/" [Summary provided by ERA-Maptec]

COMMERCIAL
type: Concept