LANDSCAPE
type: Concept

LANDSCAPE PATTERNS
type: Concept
change note: 2013-08-15 14:11:31.0 [tbs1979] update Definition (British Columbia Ministry of Forests "http://www.for.gov.bc.ca/PAB/PUBLCTNS/GLOSSARY/glossary.htm" ); update Definition (A natural space classification of living communities and their environmental conditions.);
in scheme: sciencekeywords
definition: A natural space classification of living communities and their environmental conditions.