ASSIST
type: Concept
in scheme: projects
definition: Academic Support for Spatial Information SysTems (ASSIST) is an educational project that focuses on provideing support for the GIS user community. This project is supported by the University of Leicester, Department of Geography and provides educational and training materials associated with a variety of popular GIS systems. Systems Included: 1. GRASS "http://www.geog.le.ac.uk/assist/grass/index.html" 2. Arc/Info "http://www.geog.le.ac.uk/assist/arc/index.html" 3. IDRISI "http://www.geog.le.ac.uk/assist/idrisi/index.html" Contact Information: Project ASSIST Department of Geography University of Leicester Leicester LE1 7RH UK Tel: +44 (0)116 252 3823 Fax: +44 (0)116 252 3854 email: geog&#64le.ac.uk [Summary provided by University of Leicester]

A - C
type: Concept