P - R
type: Concept

PM-ESIP
type: Concept
in scheme: projects
definition: The PM-ESIP will provide science researchers and users with the capability to interactively customize and receive hydrologic data sets for use in process studies and regional and global climate studies. It will provide a framework and a process for creating, supporting, and distributing both producer and customer defined data sets for the broader Earth Observing System (EOS) science community, incorporating emerging technologies such as data content based search (data mining) and data production, gridding, and formatting on demand. PM-ESIP datasets will be important for researching long term natural and human induced climate change ("global warming"), http://lba.cptec.inpe.br/beija-flor/send/xsltText2?fileURL=tmiwop&full_datasource=LBAESIP&full_queryString=%20AND%20datasource:(lbaesip%20)&ds_id=