Moored
type: Concept

BUOYS
type: Concept
change note: 2021-11-18 12:34:40.0 [tstevens] Move Concepts delete broader relation (null); add broader relation (BUOYS [3c5df34c-b231-460d-b3b6-4145c1fa8f25,826151] - Moored [15a80a3c-a97b-4872-896c-b7e6292663b8,835895]);
change note: 2021-11-18 08:55:09.0 [tstevens] Move Concepts delete broader relation (null); add broader relation (BUOYS [3c5df34c-b231-460d-b3b6-4145c1fa8f25,826151] - Buoys [99c4602d-1de6-4f4b-88e2-3bd13bd9a385,835891]);
change note: 2016-06-09 14:33:02.0 [epneff] added altLabel insert AltLabel (id: null text: BUOY language code: en);
alternative label: BUOY
in scheme: platforms
definition: Buoys, in the oceanographic context, are platforms whose defining characteristic is that they float at a predetermined depth in the ocean. Most often BUOYS float on the surface of the ocean. Typically, BUOYS are divided into two categories: drifting and moored buoys. Moored BUOYS are floats fixed in water to mark a location, warn of danger, or indicate a navigational channel. They can also take scientific measurements of the water including temperature and water quality measurements. Drifting BUOYS are exclusively scientific platforms that drift along the surface of the ocean following the ocean currents and/or the surface winds depending on their configuration. Along the trajectory, they collect oceanographic or meteorological data. Group: Platform_Details Entry_ID: BUOYS Group: Platform_Identification Platform_Category: In Situ Ocean-based Platforms Platform_Series_or_Entity: BUOYS Short_Name: BUOYS End_Group End_Group