NASA/LARC/SD/ASDC
type: Concept
in scheme: providers
change note: 2020-09-22 17:44:06.0 [sritz] update Definition (https://asdc.larc.nasa.gov/); update Resource (provider); update Resource (https://asdc.larc.nasa.gov/);
change note: 2017-06-12 14:12:31.0 [sritz] update Definition (https://eosweb.larc.nasa.gov/);
definition: The Atmospheric Science Data Center (ASDC) at NASA Langley Research Center is one of several Distributed Active Archive Centers (DAACs) sponsored by NASA as part of the Earth Observing System Data and Information System (EOSDIS). The ASDC is responsible for the processing, archiving, and distribution of NASA Earth science data in the areas of radiation budget, clouds, aerosols, and tropospheric chemistry. The ASDC specializes in atmospheric data important to understanding the causes and processes of global climate change and the consequences of human activities on the climate. Contact: Langley DAAC User and Data Services NASA Langley Research Center Mail Stop 157D Hampton, Virginia 23681-2199 USA (757) 864-8656 E-mail: support-asdc@earthdata.nasa.gov

NASA
type: Concept