LABORATORY
type: Concept
change note: 2021-11-30 09:07:59.0 [tstevens] Move Concepts delete broader relation (null); add broader relation (LABORATORY [3cbb9f17-ddb1-48d3-a507-786887e485af,826155] - Physical Models [c85170ef-cf60-470e-b9d0-f22c138911fd,835903]);
change note: 2021-11-18 08:38:27.0 [tstevens] Move Concepts delete broader relation (null); add broader relation (LABORATORY [3cbb9f17-ddb1-48d3-a507-786887e485af,826155] - Land-based Platforms [3850efdc-1839-4881-a7c0-347b57587850,835872]);
change note: 2021-07-23 16:56:06.0 [sritz] insert AltLabel (id: null category: primary text: LABORATORY language code: en);
in scheme: platforms
definition: A laboratory is a room or building equipped for scientific experimentation or research. (Source: The American Heritage Dictionary)

Physical Models
type: Concept