TEOM Monitor Series 1400ab
type: Concept
change note: 2021-06-08 09:05:32.0 [tstevens] insert AltLabel (id: null category: primary text: Continuous Ambient Particulate TEOM Monitor, Series 1400 ab language code: en); insert Definition (id: null text: The TEOM Monitor, Series 1400ab, measures PM-10 or PM-2.5 mass concentrations and consists of a TEOM mass sensor and control unit in a network ready configuration. The TEOM 1400ab distinguishes itself from other PM measurement methods by utilizing a direct mass measurement that is not subject to measurement uncertainties found in other surrogate technologies. The TEOM 1400ab provides a self-referencing, NIST traceable direct mass measurement. language code: en);
change note: 2021-06-08 09:04:10.0 [tstevens] Insert Concept add broader relation (TEOM Monitor Series 1400ab [3cd4f43e-c1dd-42b2-8391-07e0448b3375,635345] - Chemical Meters/Analyzers [3d25724b-832f-4a61-b0b2-4f2ccecdba94,626993]);
in scheme: instruments
definition: The TEOM Monitor, Series 1400ab, measures PM-10 or PM-2.5 mass concentrations and consists of a TEOM mass sensor and control unit in a network ready configuration. The TEOM 1400ab distinguishes itself from other PM measurement methods by utilizing a direct mass measurement that is not subject to measurement uncertainties found in other surrogate technologies. The TEOM 1400ab provides a self-referencing, NIST traceable direct mass measurement.

Chemical Meters/Analyzers
type: Concept