Surface
type: Concept

R/V Sally Ride
type: Concept
definition: Owned by the United States Office of Naval Research and operated by Scripps Institution of Oceanography, R/V Sally Ride is an Ocean Class Auxiliary General Oceanographic Research (AGOR) vessel designed to perform multidisciplinary oceanographic research worldwide, from littoral environments to the deepest ocean, from the tropics into first-year sea ice. Aboard R/V Sally Ride, new systems will permit improved over-the-side operations, station keeping, trackline maneuvering, and acoustic system performance to support demanding scientific tasks. Designed to be reliable, cost effective and flexible, the Ocean Class AGOR will capably support the evolving needs of U.S. scientists for decades to come.
change note: 2020-08-12 15:04:55.0 [sritz] Insert Concept add broader relation (R/V Sally Ride [3d58c65d-cca7-4a69-a882-c18b801411c6,560590] - SHIPS [82a67b12-e99d-4c90-8a6a-a6f79d4c3c7b,542079]);
change note: 2021-11-18 09:21:58.0 [tstevens] Move Concepts delete broader relation (null); add broader relation (R/V Sally Ride [3d58c65d-cca7-4a69-a882-c18b801411c6,826160] - Surface [59b97a6c-385e-40a2-8422-ecbdb6023c4c,835900]);
change note: 2020-08-12 15:06:44.0 [sritz] insert AltLabel (id: null category: primary text: Research Vessel Sally Ride language code: en); insert Definition (id: null text: Owned by the United States Office of Naval Research and operated by Scripps Institution of Oceanography, R/V Sally Ride is an Ocean Class Auxiliary General Oceanographic Research (AGOR) vessel designed to perform multidisciplinary oceanographic research worldwide, from littoral environments to the deepest ocean, from the tropics into first-year sea ice. Aboard R/V Sally Ride, new systems will permit improved over-the-side operations, station keeping, trackline maneuvering, and acoustic system performance to support demanding scientific tasks. Designed to be reliable, cost effective and flexible, the Ocean Class AGOR will capably support the evolving needs of U.S. scientists for decades to come. language code: en);
in scheme: platforms