ACADEMIC
type: Concept

UKS/KARS
type: Concept
in scheme: providers
definition: Kansas Applied Remote Sensing (KARS) Program. KARS is a research program of the Kansas Biological Survey at the University of Kansas that conducts research on environmental and agricultural applications of remote sensing technology. In cooperation with its commercial partner TerraMetrics, Inc., KARS facilitates technology transfer of products and services derived from remote sensing technologies to commercial, governmental, and other end users. http://www.kars.ku.edu/