Photon/Optical Detectors
type: Concept

SPEX Airborne
type: Concept
change note: 2023-06-16 10:29:52.0 [tstevens] insert AltLabel (id: null category: primary text: Spectro-Polarimeter for Exploration Airborne language code: en); insert Definition (id: null text: SPEX airborne is a multi-angle spectro-polarimeter payload designed to fly onboard NASA’s high altitude research aircraft ER-2 where it performs remote sensing measurements of aerosol and cloud particles. language code: en);
change note: 2023-06-16 10:28:57.0 [tstevens] Insert Concept add broader relation (SPEX Airborne [3e4af765-9b07-4829-8ddc-864ffc2b9677,1350577] - Photon/Optical Detectors [72227178-bb4c-4ff5-98a3-f976aa3f3714,1342089]);
in scheme: instruments
definition: SPEX airborne is a multi-angle spectro-polarimeter payload designed to fly onboard NASA’s high altitude research aircraft ER-2 where it performs remote sensing measurements of aerosol and cloud particles.