Jason-class Altimeter
type: Concept
change note: 2021-08-04 17:01:52.0 [sritz] insert AltLabel (id: null category: primary text: Jason-class Altimeter language code: en);
change note: 2019-05-10 17:14:07.0 [sritz] insert WeightedRelation (id: null related concept uuid: 63b6f3d6-3e9a-40c9-ae91-13f580c7b6c3 relationship type: null relationship value: null generated by: null);
change note: 2019-05-10 17:10:54.0 [sritz] Insert Concept add broader relation (Jason-class Altimeter [3f392e56-af78-451b-a1ba-c577aa728a4c,368817] - Radar Altimeters [92ddaaca-40b2-4936-bc1a-28cc5743e8b8,347963]);
change note: 2019-05-10 17:11:59.0 [sritz] insert Definition (id: null text: Jason-class Altimeter will collect data in the gap between the KaRIn swaths. It will send and receive signals that travel straight up and down. Each pulse's round-trip travel time will be used to determine Sea Surface height. More Information: https://swot.jpl.nasa.gov/flight_systems.htm language code: en);
in scheme: instruments
definition: Jason-class Altimeter will collect data in the gap between the KaRIn swaths. It will send and receive signals that travel straight up and down. Each pulse's round-trip travel time will be used to determine Sea Surface height. More Information: https://swot.jpl.nasa.gov/flight_systems.htm

Radar Altimeters
type: Concept