Surface
type: Concept

R/V PANDALUS
type: Concept
change note: 2021-11-18 09:24:36.0 [tstevens] Move Concepts delete broader relation (null); add broader relation (R/V PANDALUS [3fa51d3e-c177-4bfb-a189-4bba46686ec1,826171] - Surface [59b97a6c-385e-40a2-8422-ecbdb6023c4c,835900]);
in scheme: platforms
definition: The goals of the sampling from the Pandalus are to determine the distribution and abundance of surface fishes, sample surface zooplankton, measure water temperature, salinity, and fluorescence in the water column, and collect zooplankton for later studies. Samples will be taken at specific station locations along the Seward hydrographic transect (GAK line). Group: Platform_Details Entry_ID: R/V PANDALUS Group: Platform_Identification Platform_Category: In Situ Ocean-based Platforms Platform_Series_or_Entity: SHIPS Short_Name: R/V PANDALUS End_Group Creation_Date: 2012-07-19 Online_Resource: http://www.ims.uaf.edu/salmon/research/mesoscale/outreach/pandalus.htm Sample_Image: http://www.ims.uaf.edu/salmon/research/mesoscale/outreach/pictures/pandalus.jpg End_Group