Gemini
type: Concept

GEMINI-10
type: Concept
change note: 2021-11-30 12:16:52.0 [tstevens] Move Concepts delete broader relation (null); add broader relation (GEMINI-10 [3fb34887-645d-4eea-94c3-a0b15df84a3d,826172] - Solar/Space Observation Satellites [8e8b7689-0a8e-47a4-9c68-5f6a207104d5,826501]);
change note: 2021-11-30 12:21:40.0 [tstevens] Move Concepts delete broader relation (null); add broader relation (GEMINI-10 [3fb34887-645d-4eea-94c3-a0b15df84a3d,826172] - Space Stations/Crewed Spacecraft [388e72a1-b851-4b78-9e69-747e06ae215f,826132]);
change note: 2021-11-30 09:55:06.0 [tstevens] Move Concepts delete broader relation (null); add broader relation (GEMINI-10 [3fb34887-645d-4eea-94c3-a0b15df84a3d,826172] - Space-based Platforms [b39a69b4-c3b9-4a94-b296-bbbbe5e4c847,835875]);
change note: 2021-11-30 12:22:26.0 [tstevens] Move Concepts delete broader relation (null); add broader relation (GEMINI-10 [3fb34887-645d-4eea-94c3-a0b15df84a3d,826172] - GEMINI [443bd29e-d615-498d-8580-300249cb7695,826194]);
in scheme: platforms
definition: This spacecraft, an ATLAS/AGENA vehicle, was successfully launched from Cape Kennedy on July 18, 1966. It was the GEMINI X AGENA target vehicle (GATV10) with which the GEMINI 10 crew of young and collins successfully docked on July 21, 1966, 5 hr, 21 min after GEMINI 10 was launched. during rendezvous and docking, three midcourse maneuvers were effected using the GATV secondary propulsion system. In maneuver 1, the orbital apogee was changed from 163 n.m. to 414 n.m., the perigee from 158 to 160 n.m., the period from 90.4 to 94.9 min, and the inclination from 2887 to 2888 deg. During maneuver 2, the apogee was changed from 414 to 206 n.m., the perigee from 160 to 160 n.m., the period from 94.9 to 91.2 min, and the inclination from 2888 to 2886 deg. During maneuver 3, the apogee was changed from 206 to 209 n.m., the perigee from 160 to 204 n.m., the period from 91.2 to 92.0 min, and the inclination from 2886 to 2884 deg. Group: Platform_Details Entry_ID: GEMINI-10 Group: Platform_Identification Platform_Category: Space Stations/Manned Spacecraft Platform_Series_or_Entity: GEMINI Short_Name: GEMINI-10 End_Group Group: Synonymous_Platform_Names Short_Name: TITAN II Short_Name: EVA Short_Name: Pad LC-19 End_Group Group: Orbit Orbit_Inclination: 28.9 degrees Period: 92 minutes Perigee: 160 km Apogee: 206 km End_Group Creation_Date: 2008-01-18 Online_Resource: http://science.ksc.nasa.gov/history/gemini/gemini-x/gemini-x.html Sample_Image: http://science.ksc.nasa.gov/history/gemini/gemini-x/gemini-x-patch-small.gif Group: Platform_Logistics Launch_Date: 1966-07-18 Launch_Site: Cape Canaveral/Kennedy Space Center, USA Primary_Sponsor: NASA End_Group End_Group