Libera
type: Concept
change note: 2020-08-26 15:59:08.0 [sritz] Insert Concept add broader relation (LIBERA [3ffc498c-f9fc-4468-898d-321bb0595071,560660] - Radiometers [5b753e40-b3f1-426a-8d92-ffee1d675468,544211]);
change note: 2020-08-26 16:02:42.0 [sritz] insert Definition (id: null text: NASA has selected a new space-based instrument as an innovative and cost-effective approach to maintaining the 40-year data record of the balance between the solar radiation entering Earth’s atmosphere and the amount absorbed, reflected, and emitted. This radiation balance is a key factor in determining our climate: if Earth absorbs more heat than it emits, it warms up; if it emits more than it absorbs, it cools down. The new instrument, named Libera, is NASA’s first mission selected in response to the 2017 National Academies’ Earth Science Decadal Survey. The project’s principal investigator is Peter Pilewskie of the University of Colorado Laboratory for Atmospheric and Space Physics in Boulder, Colorado. “This highly innovative instrument introduces a number of new technologies such as advanced detectors that will improve the data we collect while maintaining continuity of these important radiation budget measurements,” said Sandra Cauffman, acting director of the Earth Science Division at NASA Headquarters in Washington. Libera will measure solar radiation with wavelengths between 0.3 and 5 microns reflected by the Earth system and infrared radiation with wavelengths between 5 and 50 microns emitted from the Earth system as it exits the top of the atmosphere. The sensor will also measure the total radiation leaving the Earth system at all wavelengths from 0.3 to 100 microns. An innovative additional “split shortwave” channel measuring radiation between 0.7 and 5 microns has been added to enable new Earth radiation budget science. language code: en);
change note: 2020-08-26 16:07:15.0 [sritz] update WeightedRelation (Platform-Instrument); update WeightedRelation (1.0);
change note: 2020-08-26 16:01:30.0 [sritz] Rename Concept update PrefLabel (Libera);
change note: 2020-08-26 16:06:43.0 [sritz] insert WeightedRelation (id: null related concept uuid: 2ab4ba32-0bb3-4e4e-bac6-1ff4a3baf0df relationship type: null relationship value: null generated by: null);
in scheme: instruments
definition: NASA has selected a new space-based instrument as an innovative and cost-effective approach to maintaining the 40-year data record of the balance between the solar radiation entering Earth’s atmosphere and the amount absorbed, reflected, and emitted. This radiation balance is a key factor in determining our climate: if Earth absorbs more heat than it emits, it warms up; if it emits more than it absorbs, it cools down. The new instrument, named Libera, is NASA’s first mission selected in response to the 2017 National Academies’ Earth Science Decadal Survey. The project’s principal investigator is Peter Pilewskie of the University of Colorado Laboratory for Atmospheric and Space Physics in Boulder, Colorado. “This highly innovative instrument introduces a number of new technologies such as advanced detectors that will improve the data we collect while maintaining continuity of these important radiation budget measurements,” said Sandra Cauffman, acting director of the Earth Science Division at NASA Headquarters in Washington. Libera will measure solar radiation with wavelengths between 0.3 and 5 microns reflected by the Earth system and infrared radiation with wavelengths between 5 and 50 microns emitted from the Earth system as it exits the top of the atmosphere. The sensor will also measure the total radiation leaving the Earth system at all wavelengths from 0.3 to 100 microns. An innovative additional “split shortwave” channel measuring radiation between 0.7 and 5 microns has been added to enable new Earth radiation budget science.

Radiometers
type: Concept