MRR
type: Concept
change note: 2014-05-30 04:31:48.0 [128.183.164.42] SR Updated Definition. update Definition ([Source: Marilyn Drewry, UAHuntsville/Global Hydrology Resource Center] The MRR is a frequency-modulated continuous wave (FMCW) vertically pointing Doppler radar, which operates at 24.24GHz and provides vertical profiles of drop size distribution. The MRR is the second generation of the instrument manufactured by METEK (URL: http://www.metek.de/product-details/mrr-2.html ) Group: Instrument_Details Entry_ID: MRR Group: Instrument_Identification Instrument_Category: Earth Remote Sensing Instruments Instrument_Class: Active Remote Sensing Instrument_Type: Profilers/Sounders Instrument_Subtype: Radar Sounders Short_Name: MRR Long_Name: Micro Rain Radar End_Group Group: Associated_Platforms Short_Name: AIRCRAFT End_Group Online_Resource: http://www.metek.de/product-details/mrr-2.html Creation_Date: 2012-11-26 End_Group);
change note: 2012-11-16 16:28:06.0 [saritz] Insert Concept add broader relation (MRR [4046a144-ca32-4207-8831-31b8d780ace2,82001] - Radar Sounders [6c5ca722-0bc7-4ccd-ad24-39b9d8710140,74849]);
in scheme: instruments
definition: [Source: Marilyn Drewry, UAHuntsville/Global Hydrology Resource Center] The MRR is a frequency-modulated continuous wave (FMCW) vertically pointing Doppler radar, which operates at 24.24GHz and provides vertical profiles of drop size distribution. The MRR is the second generation of the instrument manufactured by METEK (URL: http://www.metek.de/product-details/mrr-2.html ) Group: Instrument_Details Entry_ID: MRR Group: Instrument_Identification Instrument_Category: Earth Remote Sensing Instruments Instrument_Class: Active Remote Sensing Instrument_Type: Profilers/Sounders Instrument_Subtype: Radar Sounders Short_Name: MRR Long_Name: Micro Rain Radar End_Group Group: Associated_Platforms Short_Name: AIRCRAFT End_Group Online_Resource: http://www.metek.de/product-details/mrr-2.html Creation_Date: 2012-11-26 End_Group

Radar Sounders
type: Concept