EASTOIL
type: Concept
in scheme: providers
definition: The Eastern Oil Serivce provides geological products related to oil. There is information available on Kazakhstan, Azerbaijan, Turkmenistan, Russia, Ukraine, Georgia and Bulgaria. Website: "http://www.eastoil.com/"

COMMERCIAL
type: Concept