CONSORTIA/INSTITUTIONS
type: Concept

WFC
type: Concept
in scheme: providers
definition: We’re an international, non-profit, non-governmental organization working in partnership with a wide range of government and non-governmental agencies at regional, national and local levels in the developing world, and with advanced research institutions worldwide.