MSS_RS
type: Concept
change note: 2015-08-19 11:32:14.0 [mpmorahan] insert AltLabel (id: null text: Multispectral imaging system language code: en);
change note: 2015-08-19 11:18:53.0 [mpmorahan] Insert Concept add broader relation (MSS_RS [41249ca9-3c20-4dc7-a5ad-bf314b7dd542,158319] - Imaging Spectrometers/Radiometers [944b7691-af37-4fb4-9393-c114e7997829,144651]);
in scheme: instruments
definition: Multispectral imaging system (MSS) Group: Instrument_Details Entry_ID: MSS_RS Group: Instrument_Identification Instrument_Category: Earth Remote Sensing Instruments Instrument_Class: Passive Remote Sensing Instrument_Type: Spectrometers/Radiometers Instrument_Subtype: Imaging Spectrometers/Radiometers Short_Name: MSS_RS Long_Name: Multispectral imaging system End_Group Group: Associated_Platforms Short_Name: BelKA Short_Name: Kanopus-V End_Group Group: Spectral_Frequency_Information Wavelength_Keyword: Visible Spectral_Frequency_Coverage_Range: 0.5 µm - 0.6 µm End_Group Group: Spectral_Frequency_Information Wavelength_Keyword: Visible Spectral_Frequency_Coverage_Range: 0.6 µm - 0.7 µm End_Group Group: Spectral_Frequency_Information Wavelength_Keyword: Visible Spectral_Frequency_Coverage_Range: 0.7 µm - 0.8 µm End_Group Group: Spectral_Frequency_Information Wavelength_Keyword: Near Infrared Spectral_Frequency_Coverage_Range: 0.7 µm - 0.8 µm End_Group Group: Spectral_Frequency_Information Wavelength_Keyword: Near Infrared Spectral_Frequency_Coverage_Range: 0.8 µm - 0.9 µm End_Group Sample_Image: https://innoter.com/sites/default/files/uploads/articles/Kanopus/5.jpg Creation_Date: 2015-01-26 Group: Instrument_Logistics Instrument_Owner: Russia/ROSCOSMOS End_Group End_Group

Imaging Spectrometers/Radiometers
type: Concept