STRATIGRAPHIC SEQUENCE
type: Concept
change note: 2012-07-24 16:32:46.0 [mpmorahan] insert Definition (id: null text: A set of deposited sedimentary beds that reflects the depositional environment of those beds and the geologic history of a region. A stratigraphic sequence is a chronologic succession of sedimentary rocks from older below to younger above without interruption. language code: en);
change note: 2012-06-26 15:18:46.0 [gee-cee] Insert Concept add broader relation (STRATIGRAPHIC SEQUENCE [417a6538-f89e-4f73-a89a-c2e5d2cd7667,40069] - OCEAN/LAKE RECORDS [5237fae3-c98e-4d4a-9013-d7c824b3862b,40027]);
in scheme: sciencekeywords
definition: A set of deposited sedimentary beds that reflects the depositional environment of those beds and the geologic history of a region. A stratigraphic sequence is a chronologic succession of sedimentary rocks from older below to younger above without interruption.

OCEAN/LAKE RECORDS
type: Concept