G-LiHT
type: Concept
change note: 2019-10-07 11:54:17.0 [sritz] Insert Concept add broader relation (G-LiHT [41a127c4-cc9e-4aa1-84e1-24ea8031c735,369217] - G - I [af0968ce-ffe3-44a0-86de-2ec9b9a8fa5d,351587]);
change note: 2019-10-07 11:55:35.0 [sritz] insert Definition (id: null text: Goddard’s LiDAR, Hyperspectral and Thermal (G-LiHT) project at the Biospheric Sciences Laboratory at NASA’s Goddard Space Flight Center designs airborne missions that permit simultaneous measurements of vegetation structure, foliar spectra and surface temperatures. G-LiHT has been operational since 2011 and provides scientists with open access to data that are needed to understand the relationship between ecosystem form and function and to stimulate the advancement of synergistic algorithms. Additional Information: https://gliht.gsfc.nasa.gov/ language code: en);
change note: 2019-10-07 12:56:02.0 [sritz] update AltLabel (Goddard’s LiDAR, Hyperspectral and Thermal (G-LiHT) airborne imaging system);
change note: 2019-10-07 11:57:11.0 [sritz] insert AltLabel (id: null category: primary text: Goddard’s LiDAR, Hyperspectral and Thermal (G-LiHT) language code: en);
definition: Goddard’s LiDAR, Hyperspectral and Thermal (G-LiHT) project at the Biospheric Sciences Laboratory at NASA’s Goddard Space Flight Center designs airborne missions that permit simultaneous measurements of vegetation structure, foliar spectra and surface temperatures. G-LiHT has been operational since 2011 and provides scientists with open access to data that are needed to understand the relationship between ecosystem form and function and to stimulate the advancement of synergistic algorithms. Additional Information: https://gliht.gsfc.nasa.gov/
in scheme: projects

G - I
type: Concept