P - R
type: Concept

PRECP-V
type: Concept
in scheme: projects
definition: The Processing of Emissions by Clouds and Radiation Experiment (PRECP-V) was conducted by NOAA and involoves the measuring of the following atmospheric trace gases: sulfur dioxide, hydrogen peroxide, carbon monoxide, ozone, and NO-NOx.