FASTOZ
type: Concept
change note: 2022-04-18 09:10:48.0 [tstevens] insert AltLabel (id: null category: primary text: Langley In Situ Fast-Response Ozone Measurements language code: en); insert Definition (id: null text: • Technique: Chemluminescent reaction of ozone with nitric oxide • Dynamic Range: 0.6 - 1600 ppb • Accuracy: 5% or 2 ppb • Precision: 2% or 0.6 ppb • Response: 2-3 Hz; recorded at 6 Hz, reported at 1 Hz, faster data on request • Spatial Resolution: <10 m vertical (aircraft spiral), 200 m horizontal (at 400 kts) language code: en);
change note: 2022-04-18 09:09:04.0 [tstevens] Insert Concept add broader relation (FASTOZ [42273f31-d6e1-4a9e-9ca3-56fe87ffb98c,894370] - Spectrometers/Radiometers [ecd58f82-8f96-45e1-9547-dd4a02291bd9,886902]);
in scheme: instruments
definition: • Technique: Chemluminescent reaction of ozone with nitric oxide • Dynamic Range: 0.6 - 1600 ppb • Accuracy: 5% or 2 ppb • Precision: 2% or 0.6 ppb • Response: 2-3 Hz; recorded at 6 Hz, reported at 1 Hz, faster data on request • Spatial Resolution: <10 m vertical (aircraft spiral), 200 m horizontal (at 400 kts)

Spectrometers/Radiometers
type: Concept