D - F
type: Concept

F DRAKE
type: Concept
in scheme: projects
definition: Dynamic Response And Kinematics Experiment (DRAKE) is a series of experiments to obtain measurements of various quantities in the Drake Passage. One took place in 1977 (DRAKE 77) and another in 1979 (DRAKE 79). Summary Provided By: http://stommel.tamu.edu/~baum/paleo/paleogloss/node12.html