SELF-SUPERVISED
type: Concept
change note: 2022-07-27 15:36:43.0 [tstevens] update Definition (Encyclopedia of Machine Learning and Data Science: https://doi.org/10.1007/978-1-4899-7502-7);
change note: 2022-07-26 07:59:00.0 [tstevens] insert Definition (id: null text: A machine learning model type that uses context in the available sample data to predict missing or nearby data. language code: en);
change note: 2022-07-25 15:43:29.0 [tstevens] Insert Concept add broader relation (SELF-SUPERVISED [42bc61ce-8fe1-4eda-a127-6d431b21e66a,996685] - MACHINE LEARNING MODELS [fe4392b0-13a9-43ff-bacc-f44a65aed4fa,996680]);
in scheme: sciencekeywords
definition: A machine learning model type that uses context in the available sample data to predict missing or nearby data.

MACHINE LEARNING MODELS
type: Concept