NASA/GSFC/SSDOO/NSSDC/RJP
type: Concept
in scheme: providers
definition: The Radio JOVE project is a hands-on inquiry-based educational project that allows students, teachers and the general public to learn about radio astronomy by building their own radio telescope from an inexpensive kit and/or using remote radio telescopes through the internet. Participants also collaborate with each other through interactions and sharing of data on the network. The Radio JOVE project began in 1998. Since then, more than 800 teams of students and interested individuals have purchased our non-profit radio telescope kits and are learning radio astronomy by building and operating a radio telescope. This self-supporting program continues to thrive and inspire new groups of students as well as individuals Summary provided by http://radiojove.gsfc.nasa.gov/

NASA
type: Concept