A - C
type: Concept

CCMA
type: Concept
in scheme: projects
definition: CCCma is located on the beautiful University of Victoria campus, in the Ian Stewart Complex at the intersection of McKenzie Avenue and Gordon Head Road (see map). Follow this link if would like to know more about Victoria and find out how to reach us. You will find a wide range of information on this site. Be sure to check out our employment and graduate studies pages for opportunities to do research in our group. Also check out our user friendly interactive data section, where you can download data from various climate simulations performed with our models. A username and password are required. These are easily obtained by an online registration form and agreeing to the licensing conditions. Once you have applied, you will be notified of your username and password by email instantly. Information provided by http://www.cccma.ec.gc.ca/eng_index.shtml