DOI/USGS/CSAS/USGS-NPS-VCP
type: Concept
change note: 2014-04-16 09:50:55.0 [128.183.164.42] updated data center information; CBI no longer exists update AltLabel (USGS-NPS Vegetation Characterization Program, Core Science Analytics and Synthesis, U.S. Geological Survey, U.S. Department of the Interior); update PrefLabel (DOI/USGS/CSAS/USGS-NPS-VCP); update Definition (The USGS-NPS Vegetation Characterization Program is a cooperative effort by the U.S. Geological Survey (USGS) and the National Park Service Inventory & Monitoring - Vegetation Inventory Program to classify, describe, and map vegetation communities in more than 280 national park units across the United States. Through this undertaking a variety of data and information on vegetation is being made available to Internet users through this website. Vegetation in each of the participating park units is described and mapped using the National Vegetation Classification Standard of the Federal Geographic Data Committee. Use of the national standard opens up exciting opportunities to develop and share more comparable vegetation information, which facilitates well-defined analyses at different scales and across administrative boundaries. Website: "http://www.usgs.gov/core_science_systems/csas/vip/" [Summary provided by the USGS.]);
in scheme: providers
definition: The USGS-NPS Vegetation Characterization Program is a cooperative effort by the U.S. Geological Survey (USGS) and the National Park Service Inventory & Monitoring - Vegetation Inventory Program to classify, describe, and map vegetation communities in more than 280 national park units across the United States. Through this undertaking a variety of data and information on vegetation is being made available to Internet users through this website. Vegetation in each of the participating park units is described and mapped using the National Vegetation Classification Standard of the Federal Geographic Data Committee. Use of the national standard opens up exciting opportunities to develop and share more comparable vegetation information, which facilitates well-defined analyses at different scales and across administrative boundaries. Website: "http://www.usgs.gov/core_science_systems/csas/vip/" [Summary provided by the USGS.]

USGS
type: Concept