WWU/SPMC
type: Concept
change note: 2016-11-17 08:57:35.0 [gee-cee] Website URL update Definition (The mission of the Shannon Point Marine Center (SPMC) is to increase understanding of the coastal marine environment and resources of the Puget Sound basin through research and education. SPMC's academic programs support Western Washington University's undergraduate and graduate marine science curricula and special programs that target undergraduate students nationwide. Research projects target estuarine processes and traditional studies of marine biology and ecology. Facilities include sophisticated analytical laboratories, wet laboratories with running seawater, an academic vessel fleet, and on-site housing. Website: http://www.wwu.edu/spmc/ [Summary provided by Western Washington University.]);
in scheme: providers
definition: The mission of the Shannon Point Marine Center (SPMC) is to increase understanding of the coastal marine environment and resources of the Puget Sound basin through research and education. SPMC's academic programs support Western Washington University's undergraduate and graduate marine science curricula and special programs that target undergraduate students nationwide. Research projects target estuarine processes and traditional studies of marine biology and ecology. Facilities include sophisticated analytical laboratories, wet laboratories with running seawater, an academic vessel fleet, and on-site housing. Website: http://www.wwu.edu/spmc/ [Summary provided by Western Washington University.]

ACADEMIC
type: Concept