SURFACE TEMPERATURE
type: Concept

TEMPERATURE TENDENCY
type: Concept
change note: 2013-10-16 18:58:21.0 [saritz] updated definition update Definition (Glossary of Meteorology, American Meteorological Society, 1998. ); update Definition (Temperature is defined, in general, as the degree of hotness or coldness measured on some definite temperature scale by means of any of various types of thermometers. Tendency is defined as the local rate of change of a vector or scalar quantity with time at a given point in space. Because of the difficulty of measuring instantaneous variations in the atmosphere, variations are usually obtained from the differences in magnitudes over a finite period of time; and the definition of tendency is frequently broadened to include the local time variations so obtained.);
change note: 2013-09-04 14:38:03.0 [epneff] Move Concepts delete broader relation (null); add broader relation (TEMPERATURE TENDENCY [449ad1fb-8010-43c7-b994-178a049d4cff,85741] - SURFACE TEMPERATURE [5a7bb095-4d12-4232-bc75-b8e82197cb92,86389]);
in scheme: sciencekeywords
definition: Temperature is defined, in general, as the degree of hotness or coldness measured on some definite temperature scale by means of any of various types of thermometers. Tendency is defined as the local rate of change of a vector or scalar quantity with time at a given point in space. Because of the difficulty of measuring instantaneous variations in the atmosphere, variations are usually obtained from the differences in magnitudes over a finite period of time; and the definition of tendency is frequently broadened to include the local time variations so obtained.