ACADEMIC
type: Concept

MT-STATE/ECOL/ESG
type: Concept
in scheme: providers
definition: Daniel Goodman is the Director of the Environmental Statistics Group Department of Ecology located in Montana State University Bozeman, MT 59717-0346. The Department of Ecology was formed July 1st, 2000. With 15 faculty, the department's teaching and research addresses critical issues for Montana, but also tackles fundamental and applied questions around the globe. Website: http://www.montana.edu/ecology/ Info: Environmental Statistics Group